Target
Sodium-dependent noradrenaline transporter
Ligand
BDBM50063513
Substrate
Meas. Tech.
ChEMBL_1463265 (CHEMBL3399454)
IC50
158489±n/a nM
Citation
 Steffan, TRenukappa-Gutke, THöfner, GWanner, KT Design, synthesis and SAR studies of GABA uptake inhibitors derived from 2-substituted pyrrolidine-2-yl-acetic acids. Bioorg Med Chem 23:1284-306 (2015)  
Target
Name:
Sodium-dependent noradrenaline transporter
Synonyms:
Norepinephrine transporter Slc6a2 | Sodium-dependent noradrenaline transporter
Type:
Enzyme Catalytic Domain
Mol. Mass.:
69260.85
Organism:
MOUSE
Description:
Norepinephrine transporter 0 MOUSE::O55192
Residue:
617
  
Inhibitor
Name:
BDBM50063513
Synonyms:
CHEMBL3398496
Type:
Small organic molecule
Emp. Form.:
C8H13F3N2O4
Mol. Mass.:
258.195
SMILES:
OC(=O)C(F)(F)F.[H][C@@]1(CCCN1)[C@@H](N)C(O)=O
: