Target
Mitogen-activated protein kinase 1
Ligand
BDBM50030882
Substrate
Meas. Tech.
ChEMBL_1463474 (CHEMBL3399884)
Kd
1900±n/a nM
Citation
 Zhu, HYDesai, JDeng, YCooper, AWang, JShipps, JSamatar, ACarr, DWindsor, W Discovery of hydroxyaniline amides as selective Extracellular Regulated Kinase (Erk) inhibitors. Bioorg Med Chem Lett 25:1627-9 (2015)  
Target
Name:
Mitogen-activated protein kinase 1
Synonyms:
ERK2 Extracellular signal-regulated kinase 2 Extracellular signal-regulated kinase 2 (ERK2) MAPK 2 MK01_HUMAN Mitogen-activated protein kinase 1 (ERK-2) Mitogen-activated protein kinase 2 PRKM2 | p42-MAPK
Type:
Ser/Thr Protein Kinase
Mol. Mass.:
41392.76
Organism:
Homo sapiens (Human)
Description:
P28482
Residue:
360
  
Inhibitor
Name:
BDBM50030882
Synonyms:
CHEMBL3356114
Type:
Small organic molecule
Emp. Form.:
C25H30N4O4
Mol. Mass.:
450.5301
SMILES:
CC(=O)c1ccc(cc1)N1CCN(CC1)C(=O)CN1CCC(C1)C(=O)Nc1ccc(O)cc1
: