Target
Plasma kallikrein
Ligand
BDBM50063581
Substrate
Meas. Tech.
ChEMBL_1463562 (CHEMBL3398780)
Ki
5.0±n/a nM
Citation
 Pinto, DJSmallheer, JMCorte, JRAustin, EJWang, CFang, TSmith, LMRossi, KARendina, ARBozarth, JMZhang, GWei, ARamamurthy, VSheriff, SMyers, JEMorin, PELuettgen, JMSeiffert, DAQuan, MLWexler, RR Structure-based design of inhibitors of coagulation factor XIa with novel P1 moieties. Bioorg Med Chem Lett 25:1635-42 (2015)  
Target
Name:
Plasma kallikrein
Synonyms:
Fletcher factor KLKB1 Kallikrein Plasma kallikrein heavy chain Plasma prekallikrein
Type:
Protein
Mol. Mass.:
71391.16
Organism:
Homo sapiens (Human)
Description:
P03952
Residue:
638
  
Inhibitor
Name:
BDBM50063581
Synonyms:
CHEMBL3398612
Type:
Small organic molecule
Emp. Form.:
C26H30ClN7O
Mol. Mass.:
492.016
SMILES:
NC[C@H]1CC[C@@H](CC1)C(=O)N[C@@H](Cc1ccccc1)c1nc(c(Cl)[nH]1)-c1ccc2c(N)n[nH]c2c1
: