Target
Coagulation factor XI
Ligand
BDBM50063583
Substrate
Meas. Tech.
ChEMBL_1463486 (CHEMBL3399896)
Ki
1.2±n/a nM
Citation
 Pinto, DJSmallheer, JMCorte, JRAustin, EJWang, CFang, TSmith, LMRossi, KARendina, ARBozarth, JMZhang, GWei, ARamamurthy, VSheriff, SMyers, JEMorin, PELuettgen, JMSeiffert, DAQuan, MLWexler, RR Structure-based design of inhibitors of coagulation factor XIa with novel P1 moieties. Bioorg Med Chem Lett 25:1635-42 (2015)  
Target
Name:
Coagulation factor XI
Synonyms:
Coagulation factor XIa Coagulation factor XIa light chain FA11_HUMAN Factor XIa PTA | Plasma thromboplastin antecedent
Type:
Enzyme
Mol. Mass.:
70130.58
Organism:
Homo sapiens (Human)
Description:
P03951
Residue:
625
  
Inhibitor
Name:
BDBM50063583
Synonyms:
CHEMBL3398644
Type:
Small organic molecule
Emp. Form.:
C28H22Cl2N10O
Mol. Mass.:
585.447
SMILES:
Nc1n[nH]c2cc(ccc12)-c1nc([nH]c1Cl)[C@H](Cc1ccccc1)NC(=O)\C=C\c1cc(Cl)ccc1-n1cnnn1
: