Target
Histone-lysine N-methyltransferase KMT5C
Ligand
BDBM50063670
Substrate
Meas. Tech.
ChEMBL_1463680 (CHEMBL3399139)
IC50
>100000±n/a nM
Citation
 Kung, PPHuang, BZehnder, LTatlock, JBingham, PKrivacic, CGajiwala, KDiehl, WYu, XMaegley, KA SAH derived potent and selective EZH2 inhibitors. Bioorg Med Chem Lett 25:1532-7 (2015)  
Target
Name:
Histone-lysine N-methyltransferase KMT5C
Synonyms:
Histone-lysine N-methyltransferase SUV420H2 KMT5C_HUMAN Protein lysine methyltransferase SUV4-20H2 (SUV4-20H2) Su(var)4-20 homolog 2 Suv4-20h2
Type:
Enzyme
Mol. Mass.:
52147.69
Organism:
Homo sapiens (Human)
Description:
Q86Y97
Residue:
462
  
Inhibitor
Name:
BDBM50063670
Synonyms:
CHEMBL3397332
Type:
Small organic molecule
Emp. Form.:
C24H29N9O4S
Mol. Mass.:
539.61
SMILES:
N[C@@H](CCSC[C@H]1O[C@H]([C@H](O)[C@@H]1O)n1cnc2c(N)ncnc12)C(=O)NCc1cc([nH]n1)-c1ccccc1
: