Target
Histone-lysine N-methyltransferase EZH2
Ligand
BDBM50063680
Substrate
Meas. Tech.
ChEMBL_1463615 (CHEMBL3398933)
IC50
40000±n/a nM
Citation
 Kung, PPHuang, BZehnder, LTatlock, JBingham, PKrivacic, CGajiwala, KDiehl, WYu, XMaegley, KA SAH derived potent and selective EZH2 inhibitors. Bioorg Med Chem Lett 25:1532-7 (2015)  
Target
Name:
Histone-lysine N-methyltransferase EZH2
Synonyms:
ENX-1 EZH2_HUMAN Histone-lysine N-methyltransferase EZH2 Lysine N-methyltransferase 6
Type:
Protein
Mol. Mass.:
85367.84
Organism:
Homo sapiens (Human)
Description:
Q15910
Residue:
746
  
Inhibitor
Name:
BDBM50063680
Synonyms:
CHEMBL3397319
Type:
Small organic molecule
Emp. Form.:
C20H29N9O4S
Mol. Mass.:
491.567
SMILES:
Cc1cc(CNC(=O)[C@@H](N)CCSC[C@H]2O[C@H]([C@H](O)[C@@H]2O)n2cnc3c(N)ncnc23)n(C)n1
: