Target
Thyroid hormone receptor beta
Ligand
BDBM50063755
Substrate
Meas. Tech.
ChEMBL_1463692 (CHEMBL3399151)
Ki
0.090000±n/a nM
Citation
 Burkholder, TPCunningham, BEClayton, JRLander, PABrown, MLDoti, RADurst, GLMontrose-Rafizadeh, CKing, COsborne, HEAmos, RMZink, RWStramm, LEBurris, TPCardona, GKonkol, DLReidy, CChriste, MEGenin, MJ Design and synthesis of a novel series of [1-(4-hydroxy-benzyl)-1H-indol-5-yloxy]-acetic acid compounds as potent, selective, thyroid hormone receptorß agonists. Bioorg Med Chem Lett 25:1377-80 (2015)  
Target
Name:
Thyroid hormone receptor beta
Synonyms:
ERBA2 Nuclear receptor subfamily 1 group A member 2 THR1 c-erbA-2 | c-erbA-beta
Type:
Receptor
Mol. Mass.:
52793.62
Organism:
Homo sapiens (Human)
Description:
Recombinant hThR was obtained from nuclear extracts from SF9 cells infected with baculovirus vectors encoding for ThRbeta 1.
Residue:
461
  
Inhibitor
Name:
BDBM50063755
Synonyms:
CHEMBL3397341
Type:
Small organic molecule
Emp. Form.:
C21H22ClNO4
Mol. Mass.:
387.857
SMILES:
CC(C)c1cc(Cn2cc(C)c3cc(OCC(O)=O)cc(Cl)c23)ccc1O
: