Target
Oligo-1,6-glucosidase IMA1
Ligand
BDBM50063757
Substrate
Meas. Tech.
ChEMBL_1463722 (CHEMBL3399253)
IC50
16000±n/a nM
Citation
 Han, KLi, YZhang, YTeng, YMa, YWang, MWang, RXu, WYao, QZhang, YQin, HSun, HYu, P Design, synthesis and docking study of novel tetracyclic oxindole derivatives asa-glucosidase inhibitors. Bioorg Med Chem Lett 25:1471-5 (2015)  
Target
Name:
Oligo-1,6-glucosidase IMA1
Synonyms:
α-glucosidase Alpha-glucosidase (α-glucosidase) MALX3_YEAST | Oligo-1,6-glucosidase
Type:
Protein
Mol. Mass.:
68577.59
Organism:
Saccharomyces cerevisiae S288c (Baker's yeast)
Description:
Residue:
589
  
Inhibitor
Name:
BDBM50063757
Synonyms:
CHEMBL3397481
Type:
Small organic molecule
Emp. Form.:
C24H17NO5
Mol. Mass.:
399.3955
SMILES:
OC(=O)CC1Oc2ccccc2-c2ccc3N(Cc4ccccc4)C(=O)C(=O)c3c12
: