Target
Amine oxidase [flavin-containing] B
Ligand
BDBM50049240
Substrate
Meas. Tech.
ChEMBL_1464353 (CHEMBL3404812)
Ki
199±n/a nM
Citation
 Rojas, RJEdmondson, DEAlmos, TScott, RMassari, ME Reversible and irreversible small molecule inhibitors of monoamine oxidase B (MAO-B) investigated by biophysical techniques. Bioorg Med Chem 23:770-8 (2015)  
Target
Name:
Amine oxidase [flavin-containing] B
Synonyms:
AOFB_HUMAN MAOB Monoamine oxidase type B (MAO B) Monoamine oxidase type B (MAOB)
Type:
Protein
Mol. Mass.:
58768.76
Organism:
Homo sapiens (Human)
Description:
P27338
Residue:
520
  
Inhibitor
Name:
BDBM50049240
Synonyms:
(+-)-5-((4-(2-(5-ethyl-2-pyridinyl)ethoxy)phenyl)methyl)-2,4-thiazolidinedione CHEMBL595 PIOGLITAZONE HYDROCHLORIDE
Type:
Small organic molecule
Emp. Form.:
C19H20N2O3S
Mol. Mass.:
356.439
SMILES:
CCc1ccc(CCOc2ccc(Cc3sc(=O)[nH]c3O)cc2)nc1
: