Target
Amine oxidase [flavin-containing] B
Ligand
BDBM50063994
Substrate
Meas. Tech.
ChEMBL_1464177 (CHEMBL3407043)
Ki
997±n/a nM
Citation
 Rojas, RJEdmondson, DEAlmos, TScott, RMassari, ME Reversible and irreversible small molecule inhibitors of monoamine oxidase B (MAO-B) investigated by biophysical techniques. Bioorg Med Chem 23:770-8 (2015)  
Target
Name:
Amine oxidase [flavin-containing] B
Synonyms:
AOFB_HUMAN MAOB Monoamine oxidase type B (MAO B) Monoamine oxidase type B (MAOB)
Type:
Protein
Mol. Mass.:
58768.76
Organism:
Homo sapiens (Human)
Description:
P27338
Residue:
520
  
Inhibitor
Name:
BDBM50063994
Synonyms:
CHEMBL338404 | Ro-166491
Type:
Small organic molecule
Emp. Form.:
C9H11ClN2O
Mol. Mass.:
198.649
SMILES:
NCCNC(=O)c1ccc(Cl)cc1
: