Target
Adenosine receptor A1
Ligand
BDBM50064620
Substrate
Meas. Tech.
ChEMBL_1465024 (CHEMBL3405040)
Ki
7750±n/a nM
Citation
 Pandya, DHSharma, JAJalani, HBPandya, ANSudarsanam, VKachler, SKlotz, KNVasu, KK Novel thiazole-thiophene conjugates as adenosine receptor antagonists: synthesis, biological evaluation and docking studies. Bioorg Med Chem Lett 25:1306-9 (2015)  
Target
Name:
Adenosine receptor A1
Synonyms:
A1 adenosine receptor (hA1) AA1R_HUMAN ADORA1 Adenosine A1-receptor Adenosine receptor A1 (hA1) | Adenosine transporter (AdT)
Type:
G Protein-Coupled Receptor (GPCR)
Mol. Mass.:
36520.92
Organism:
Homo sapiens (Human)
Description:
P30542
Residue:
326
  
Inhibitor
Name:
BDBM50064620
Synonyms:
CHEMBL3403728
Type:
Small organic molecule
Emp. Form.:
C28H27N3O3S2
Mol. Mass.:
517.662
SMILES:
CCOC(=O)c1c(NC(=O)c2sc(Nc3ccccc3)nc2-c2ccc(C)cc2)sc2CCCCc12
: