Target
Adenosine receptor A2a
Ligand
BDBM50064635
Substrate
Meas. Tech.
ChEMBL_1465025 (CHEMBL3405041)
Ki
>30000±n/a nM
Citation
 Pandya, DHSharma, JAJalani, HBPandya, ANSudarsanam, VKachler, SKlotz, KNVasu, KK Novel thiazole-thiophene conjugates as adenosine receptor antagonists: synthesis, biological evaluation and docking studies. Bioorg Med Chem Lett 25:1306-9 (2015)  
Target
Name:
Adenosine receptor A2a
Synonyms:
A2A adenosine receptor (hA2A) ADENOSINE A2 ADORA2 Adenosine A2A receptor (A2AAR)
Type:
G Protein-Coupled Receptor (GPCR)
Mol. Mass.:
44716.46
Organism:
Homo sapiens (Human)
Description:
P29274
Residue:
412
  
Inhibitor
Name:
BDBM50064635
Synonyms:
CHEMBL3403725
Type:
Small organic molecule
Emp. Form.:
C23H25N3O3S2
Mol. Mass.:
455.593
SMILES:
CCOC(=O)c1c(NC(=O)c2sc(Nc3ccc(C)cc3)nc2C)sc2CCCCc12
: