Target
Probable G-protein coupled receptor 88
Ligand
BDBM50064747
Substrate
Meas. Tech.
ChEMBL_1465054 (CHEMBL3405070)
EC50
120±n/a nM
Citation
 Dzierba, CDBi, YDasgupta, BHartz, RAAhuja, VCianchetta, GKumi, GDong, LAleem, SFink, CGarcia, YGreen, MHan, JKwon, SQiao, YWang, JZhang, YLiu, YZipp, GLiang, ZBurford, NFerrante, MBertekap, RLewis, MCacace, AGrace, JWilson, ANouraldeen, AWestphal, RKimball, DCarson, KBronson, JJMacor, JE Design, synthesis, and evaluation of phenylglycinols and phenyl amines as agonists of GPR88. Bioorg Med Chem Lett 25:1448-52 (2015)  
Target
Name:
Probable G-protein coupled receptor 88
Synonyms:
GPR88 Probable G-protein coupled receptor 88 Striatum-specific G-protein coupled receptor
Type:
PROTEIN
Mol. Mass.:
40264.74
Organism:
Homo sapiens (Human)
Description:
ChEMBL_109566
Residue:
384
  
Inhibitor
Name:
BDBM50064747
Synonyms:
CHEMBL3403776
Type:
Small organic molecule
Emp. Form.:
C23H31NO4
Mol. Mass.:
385.4965
SMILES:
CCCC(C)COc1ccc(cc1)[C@H](CO)NC(=O)[C@@H](OC)c1ccccc1
: