Target
Tyrosine-protein kinase BTK
Ligand
BDBM50064863
Substrate
Meas. Tech.
ChEMBL_1465191 (CHEMBL3406075)
IC50
160±n/a nM
Citation
 Young, WBBarbosa, JBlomgren, PBremer, MCCrawford, JJDambach, DGallion, SHymowitz, SGKropf, JELee, SHLiu, LLubach, JWMacaluso, JMaciejewski, PMaurer, BMitchell, SAOrtwine, DFDi Paolo, JReif, KScheerens, HSchmitt, ASowell, CGWang, XWong, HXiong, JMXu, JZhao, ZCurrie, KS Potent and selective Bruton's tyrosine kinase inhibitors: discovery of GDC-0834. Bioorg Med Chem Lett 25:1333-7 (2015)  
Target
Name:
Tyrosine-protein kinase BTK
Synonyms:
ATK B-cell progenitor kinase Bpk Btk | Kinase EMB
Type:
PROTEIN
Mol. Mass.:
76447.19
Organism:
Mus musculus
Description:
ChEMBL_108319
Residue:
659
  
Inhibitor
Name:
BDBM50064863
Synonyms:
CHEMBL3401292
Type:
Small organic molecule
Emp. Form.:
C33H36N6O3S
Mol. Mass.:
596.742
SMILES:
CN1CCN(C)C(=O)[C@@H]1c1ccc(Nc2nc(cn(C)c2=O)-c2cccc(NC(=O)c3cc4CCCCc4s3)c2C)cc1
: