Target
Tyrosine-protein kinase BTK
Ligand
BDBM50064874
Substrate
Meas. Tech.
ChEMBL_1465191 (CHEMBL3406075)
IC50
2800±n/a nM
Citation
 Young, WBBarbosa, JBlomgren, PBremer, MCCrawford, JJDambach, DGallion, SHymowitz, SGKropf, JELee, SHLiu, LLubach, JWMacaluso, JMaciejewski, PMaurer, BMitchell, SAOrtwine, DFDi Paolo, JReif, KScheerens, HSchmitt, ASowell, CGWang, XWong, HXiong, JMXu, JZhao, ZCurrie, KS Potent and selective Bruton's tyrosine kinase inhibitors: discovery of GDC-0834. Bioorg Med Chem Lett 25:1333-7 (2015)  
Target
Name:
Tyrosine-protein kinase BTK
Synonyms:
ATK B-cell progenitor kinase Bpk Btk | Kinase EMB
Type:
PROTEIN
Mol. Mass.:
76447.19
Organism:
Mus musculus
Description:
ChEMBL_108319
Residue:
659
  
Inhibitor
Name:
BDBM50064874
Synonyms:
CHEMBL3401270
Type:
Small organic molecule
Emp. Form.:
C33H35N5O5
Mol. Mass.:
581.6615
SMILES:
Cc1c(NC(=O)c2ccc(cc2)C(C)(C)O)cccc1-c1cn(C)c(=O)c(Nc2ccc(cc2)C(=O)N2CCOCC2)n1
: