Target
5-hydroxytryptamine receptor 2A
Ligand
BDBM50065046
Substrate
Meas. Tech.
ChEMBL_1465386 (CHEMBL3406942)
Ki
1000±n/a nM
Citation
 Sakhuja, RKondabolu, KCórdova-Sintjago, TTravers, SVincek, ASKim, MSAbboud, KAFang, LSun, ZCanal, CEBooth, RG Novel 4-substituted-N,N-dimethyltetrahydronaphthalen-2-amines: synthesis, affinity, and in silico docking studies at serotonin 5-HT2-type and histamine H1 G protein-coupled receptors. Bioorg Med Chem 23:1588-600 (2015)  
Target
Name:
5-hydroxytryptamine receptor 2A
Synonyms:
5-HT-2 5-HT2A 5-hydroxytryptamine receptor 2A (5HT-2A) 5HT2A_HUMAN HTR2A | Serotonin receptor 2A
Type:
undefined
Mol. Mass.:
52607.65
Organism:
Homo sapiens (Human)
Description:
P28223
Residue:
471
  
Inhibitor
Name:
BDBM50065046
Synonyms:
CHEMBL3402686
Type:
Small organic molecule
Emp. Form.:
C19H24ClN
Mol. Mass.:
301.854
SMILES:
Cl.CN(C)[C@H]1C[C@H](c2ccccc2C)c2ccccc2C1
: