Target
Monoacylglycerol lipase ABHD6
Ligand
BDBM50065640
Substrate
Meas. Tech.
ChEMBL_1464458 (CHEMBL3405400)
IC50
1780±n/a nM
Citation
 Patel, JZAhenkorah, SVaara, MStaszewski, MAdams, YLaitinen, TNavia-Paldanius, DParkkari, TSavinainen, JRWalczynski, KLaitinen, JTNevalainen, TJ Loratadine analogues as MAGL inhibitors. Bioorg Med Chem Lett 25:1436-42 (2015)  
Target
Name:
Monoacylglycerol lipase ABHD6
Synonyms:
2-arachidonoylglycerol hydrolase ABHD6_HUMAN Monoacylglycerol lipase ABHD6
Type:
PROTEIN
Mol. Mass.:
38341.83
Organism:
Homo sapiens (Human)
Description:
ChEMBL_105457
Residue:
337
  
Inhibitor
Name:
BDBM50065640
Synonyms:
CHEMBL3401455
Type:
Small organic molecule
Emp. Form.:
C22H20ClN5O
Mol. Mass.:
405.88
SMILES:
Clc1ccc2c(-[#6]-[#6]-c3cccnc3\[#6]-2=[#6]-2\[#6]-[#6]-[#7](-[#6]-[#6]-2)-[#6](=O)-n2cncn2)c1
: