Target
Probable G-protein coupled receptor 88
Ligand
BDBM50065938
Substrate
Meas. Tech.
ChEMBL_1464732 (CHEMBL3407083)
EC50
110±n/a nM
Citation
 Bi, YDzierba, CDFink, CGarcia, YGreen, MHan, JKwon, SKumi, GLiang, ZLiu, YQiao, YZhang, YZipp, GBurford, NFerrante, MBertekap, RLewis, MCacace, AWestphal, RSKimball, DBronson, JJMacor, JE The discovery of potent agonists for GPR88, an orphan GPCR, for the potential treatment of CNS disorders. Bioorg Med Chem Lett 25:1443-7 (2015)  
Target
Name:
Probable G-protein coupled receptor 88
Synonyms:
GPR88 Probable G-protein coupled receptor 88 Striatum-specific G-protein coupled receptor
Type:
PROTEIN
Mol. Mass.:
40264.74
Organism:
Homo sapiens (Human)
Description:
ChEMBL_109566
Residue:
384
  
Inhibitor
Name:
BDBM50065938
Synonyms:
CHEMBL3400275
Type:
Small organic molecule
Emp. Form.:
C32H38N2O3
Mol. Mass.:
498.6557
SMILES:
CC[C@H](C)[C@H](N)CN(C(=O)[C@@H]1C[C@H]1c1ccccc1)c1ccc(cc1)-c1ccc(CCC(=O)OC)cc1
: