Target
Carbonic anhydrase 2
Ligand
BDBM50066132
Substrate
Meas. Tech.
ChEMBL_1465100 (CHEMBL3405432)
Ki
12±n/a nM
Citation
 Carta, FDi Cesare Mannelli, LPinard, MGhelardini, CScozzafava, AMcKenna, RSupuran, CT A class of sulfonamide carbonic anhydrase inhibitors with neuropathic pain modulating effects. Bioorg Med Chem 23:1828-40 (2015)  
Target
Name:
Carbonic anhydrase 2
Synonyms:
CA-II CAC Carbonate dehydratase II Carbonic anhydrase 2 (CA-II) Carbonic anhydrase C Carbonic anhydrase II (CA-II) Carbonic anhydrase II (hCA II) | Carbonic anhydrase isoenzyme II (hCA II)
Type:
Enzyme
Mol. Mass.:
29250.71
Organism:
Homo sapiens (Human)
Description:
P00918
Residue:
260
  
Inhibitor
Name:
BDBM50066132
Synonyms:
CHEMBL3402960
Type:
Small organic molecule
Emp. Form.:
C9H11NO3S
Mol. Mass.:
213.254
SMILES:
NS(=O)(=O)c1ccc(OCC=C)cc1
: