Target
Carbonic anhydrase 2
Ligand
BDBM10872
Substrate
Meas. Tech.
ChEMBL_1465409 (CHEMBL3407117)
Ki
30±n/a nM
Citation
 Vullo, DDe Luca, VDel Prete, SCarginale, VScozzafava, ACapasso, CSupuran, CT Sulfonamide inhibition studies of theż-carbonic anhydrase from the Antarctic cyanobacterium Nostoc commune. Bioorg Med Chem 23:1728-34 (2015)  
Target
Name:
Carbonic anhydrase 2
Synonyms:
CA-II CAC Carbonate dehydratase II Carbonic anhydrase 2 (CA-II) Carbonic anhydrase C Carbonic anhydrase II (CA-II) Carbonic anhydrase II (hCA II) | Carbonic anhydrase isoenzyme II (hCA II)
Type:
Enzyme
Mol. Mass.:
29250.71
Organism:
Homo sapiens (Human)
Description:
P00918
Residue:
260
  
Inhibitor
Name:
BDBM10872
Synonyms:
4-amino-N-[2-(4-sulfamoylphenyl)ethyl]benzene-1-sulfonamide aromatic/heteroaromatic sulfonamide 17
Type:
Small organic molecule
Emp. Form.:
C14H17N3O4S2
Mol. Mass.:
355.432
SMILES:
Nc1ccc(cc1)S(=O)(=O)NCCc1ccc(cc1)S(N)(=O)=O
: