Target
Carbonic anhydrase 1
Ligand
BDBM10883
Substrate
Meas. Tech.
ChEMBL_1465408 (CHEMBL3407116)
Ki
1200±n/a nM
Citation
 Vullo, DDe Luca, VDel Prete, SCarginale, VScozzafava, ACapasso, CSupuran, CT Sulfonamide inhibition studies of theż-carbonic anhydrase from the Antarctic cyanobacterium Nostoc commune. Bioorg Med Chem 23:1728-34 (2015)  
Target
Name:
Carbonic anhydrase 1
Synonyms:
CA-I CAB Carbonate dehydratase I Carbonic anhydrase 1 (CA I) Carbonic anhydrase 1 (Recombinant CA I) Carbonic anhydrase B Carbonic anhydrase I (CA I) Carbonic anhydrase I (CAI) Carbonic anhydrase isoenzyme I (hCA I) | hCA
Type:
Enzyme
Mol. Mass.:
28873.37
Organism:
Homo sapiens (Human)
Description:
P00915
Residue:
261
  
Inhibitor
Name:
BDBM10883
Synonyms:
4,5-dichlorobenzene-1,3-disulfonamide Dichlorophenamide Dichlorophenamide, DCP US10172837, Dichlorphenamide | sulfonamide 4
Type:
Small organic molecule
Emp. Form.:
C6H6Cl2N2O4S2
Mol. Mass.:
305.159
SMILES:
NS(=O)(=O)c1cc(Cl)c(Cl)c(c1)S(N)(=O)=O
: