Target
Bifunctional epoxide hydrolase 2
Ligand
BDBM50066844
Substrate
Meas. Tech.
ChEMBL_1465995 (CHEMBL3406977)
IC50
3.2±n/a nM
Citation
 Takai, KChiyo, NNakajima, TNariai, TIshikawa, CNakatani, SIkeno, AYamamoto, SSone, T Three-dimensional rational approach to the discovery of potent substituted cyclopropyl urea soluble epoxide hydrolase inhibitors. Bioorg Med Chem Lett 25:1705-8 (2015)  
Target
Name:
Bifunctional epoxide hydrolase 2
Synonyms:
Ephx2 HYES_RAT
Type:
PROTEIN
Mol. Mass.:
62337.15
Organism:
Rattus norvegicus
Description:
ChEMBL_1465995
Residue:
554
  
Inhibitor
Name:
BDBM50066844
Synonyms:
CHEMBL3401635
Type:
Small organic molecule
Emp. Form.:
C30H30F2N2O4
Mol. Mass.:
520.567
SMILES:
OC(=O)CCc1ccc(OC2CCN(CC2)C(=O)N[C@H]2[C@@H]([C@@H]2c2ccc(F)cc2)c2ccc(F)cc2)cc1
: