Target
Muscarinic acetylcholine receptor M2
Ligand
BDBM50066854
Substrate
Meas. Tech.
ChEMBL_1465997 (CHEMBL3406979)
IC50
30±n/a nM
Citation
 Prat, MBuil, MAFernández, MDTort, LMonleón, JMCasals, GFerrer, MCastro, JGavaldà, AMiralpeix, MRamos, IVilella, DHuerta, JMEspinosa, SHernández, BSegarra, VCórdoba, M Discovery of novel quaternary ammonium derivatives of (3R)-quinuclidinyl amides as potent and long acting muscarinic antagonists. Bioorg Med Chem Lett 25:1736-41 (2015)  
Target
Name:
Muscarinic acetylcholine receptor M2
Synonyms:
ACM2_HUMAN Cholinergic, muscarinic M2 Muscarinic acetylcholine receptor M2 and M5 | RecName: Full=Muscarinic acetylcholine receptor M2
Type:
GPCR
Mol. Mass.:
51730.61
Organism:
Homo sapiens (Human)
Description:
P08172
Residue:
466
  
Inhibitor
Name:
BDBM50066854
Synonyms:
CHEMBL3401654
Type:
Small organic molecule
Emp. Form.:
C30H33BrN2O3
Mol. Mass.:
549.499
SMILES:
[Br-].O=C(N[C@H]1C[N+]2(CCCOc3ccccc3)CCC1CC2)C1c2ccccc2Oc2ccccc12
: