Target
High affinity choline transporter 1
Ligand
BDBM87577
Substrate
Meas. Tech.
ChEMBL_1464243 (CHEMBL3404110)
IC50
4470±n/a nM
Citation
 Bollinger, SREngers, DWEnnis, EAWright, JLocuson, CWLindsley, CWBlakely, RDHopkins, CR Synthesis and structure-activity relationships of a series of 4-methoxy-3-(piperidin-4-yl)oxy benzamides as novel inhibitors of the presynaptic choline transporter. Bioorg Med Chem Lett 25:1757-60 (2015)  
Target
Name:
High affinity choline transporter 1
Synonyms:
CHT1 SC5A7_HUMAN high affinity choline transporter 1
Type:
PROTEIN
Mol. Mass.:
63194.33
Organism:
Homo sapiens (Human)
Description:
ChEMBL_1464247
Residue:
580
  
Inhibitor
Name:
BDBM87577
Synonyms:
3-[(1-isopropyl-4-piperidyl)oxy]-4-methoxy-N-(1-methyl-2-pyrazin-2-yl-ethyl)benzamide 4-methoxy-3-[(1-propan-2-yl-4-piperidinyl)oxy]-N-[1-(2-pyrazinyl)propan-2-yl]benzamide SMR000659568 | cid_24793875
Type:
Small organic molecule
Emp. Form.:
C23H32N4O3
Mol. Mass.:
412.5252
SMILES:
COc1ccc(cc1OC1CCN(CC1)C(C)C)C(=O)NC(C)Cc1cnccn1
: