Target
Proto-oncogene tyrosine-protein kinase Src
Ligand
BDBM50067539
Substrate
Meas. Tech.
ChEMBL_1465694 (CHEMBL3405455)
Ki
>4000±n/a nM
Citation
 Boyd, MJBandarage, UKBennett, HByrn, RRDavies, IGu, WJacobs, MLedeboer, MWLedford, BLeeman, JRPerola, EWang, TBennani, YClark, MPCharifson, PS Isosteric replacements of the carboxylic acid of drug candidate VX-787: Effect of charge on antiviral potency and kinase activity of azaindole-based influenza PB2 inhibitors. Bioorg Med Chem Lett 25:1990-4 (2015)  
Target
Name:
Proto-oncogene tyrosine-protein kinase Src
Synonyms:
Calmodulin/Proto-oncogene tyrosine-protein kinase Src Proto-oncogene c-Src SRC SRC_HUMAN V-src sarcoma (Schmidt-Ruppin A-2) viral oncogene homolog (avian) p60-Src | pp60c-src
Type:
Protein
Mol. Mass.:
59838.60
Organism:
Homo sapiens (Human)
Description:
P12931
Residue:
536
  
Inhibitor
Name:
BDBM50067539
Synonyms:
CHEMBL3401989
Type:
Small organic molecule
Emp. Form.:
C22H21F2N7O
Mol. Mass.:
437.4452
SMILES:
Cc1nnc(o1)[C@H]1C2CCC(CC2)[C@@H]1Nc1nc(ncc1F)-c1c[nH]c2ncc(F)cc12
: