Target
Retinoic acid receptor alpha
Ligand
BDBM53426
Substrate
Meas. Tech.
ChEMBL_1466191 (CHEMBL3405115)
EC50
200±n/a nM
Citation
 Nakashima, KTanaka, TMurata, HKaburagi, KInoue, M Xanthones from the roots of Maclura cochinchinensis var. gerontogea and their retinoic acid receptor-a agonistic activity. Bioorg Med Chem Lett 25:1998-2001 (2015)  
Target
Name:
Retinoic acid receptor alpha
Synonyms:
NR1B1 RAR-alpha RARA_HUMAN Retinoic acid receptor alpha/Retinoid X receptor alpha Retinoid receptor
Type:
PROTEIN
Mol. Mass.:
50778.87
Organism:
Homo sapiens (Human)
Description:
ChEMBL_1466191
Residue:
462
  
Inhibitor
Name:
BDBM53426
Synonyms:
Acylated oxime isatin derivative, 15 SMR000470964 gerontoxanthone A
Type:
Small organic molecule
Emp. Form.:
C23H22O6
Mol. Mass.:
394.4172
SMILES:
CC1Oc2cc3oc4c(O)c5OC(C)(C)C=Cc5cc4c(=O)c3c(O)c2C1(C)C
: