Target
Protease
Ligand
BDBM8125
Substrate
Meas. Tech.
ChEMBL_1466205 (CHEMBL3405129)
Temperature
298.15±n/a K
IC50
0.061000±n/a nM
Comments
extracted
Citation
 Yang, ZHBai, XGZhou, LWang, JXLiu, HTWang, YC Synthesis and biological evaluation of novel HIV-1 protease inhibitors using tertiary amine as P2-ligands. Bioorg Med Chem Lett 25:1880-3 (2015)  
Target
Name:
Protease
Synonyms:
Type:
Enzyme
Mol. Mass.:
10904.79
Organism:
Human immunodeficiency virus 1 (HIV-1)
Description:
Q9YQ12
Residue:
99
  
Inhibitor
Name:
BDBM8125
Synonyms:
(3R,3aS,6aR)-hexahydrofuro[2,3-b]furan-3-yl N-[(2S,3R)-4-[(4-aminobenzene)(2-methylpropyl)sulfonamido]-3-hydroxy-1-phenylbutan-2-yl]carbamate Darunavir TMC-114 US10806794, Compound Darunavir
Type:
Small organic molecule
Emp. Form.:
C27H37N3O7S
Mol. Mass.:
547.664
SMILES:
[H][C@@]1(CO[C@@]2([H])OCC[C@@]12[H])OC(=O)N[C@@H](Cc1ccccc1)[C@H](O)CN(CC(C)C)S(=O)(=O)c1ccc(N)cc1
: