Target
Protease
Ligand
BDBM50067650
Substrate
Meas. Tech.
ChEMBL_1466205 (CHEMBL3405129)
Temperature
298.15±n/a K
IC50
73±n/a nM
Comments
extracted
Citation
 Yang, ZHBai, XGZhou, LWang, JXLiu, HTWang, YC Synthesis and biological evaluation of novel HIV-1 protease inhibitors using tertiary amine as P2-ligands. Bioorg Med Chem Lett 25:1880-3 (2015)  
Target
Name:
Protease
Synonyms:
Type:
Enzyme
Mol. Mass.:
10904.79
Organism:
Human immunodeficiency virus 1 (HIV-1)
Description:
Q9YQ12
Residue:
99
  
Inhibitor
Name:
BDBM50067650
Synonyms:
CHEMBL3400712
Type:
Small organic molecule
Emp. Form.:
C36H47N5O8S
Mol. Mass.:
709.852
SMILES:
CC(C)CN(C[C@@H](O)[C@H](Cc1ccccc1)NC(=O)CN(CC(=O)N1CCOCC1)c1c(C)cccc1C)S(=O)(=O)c1ccc(cc1)[N+]([O-])=O
: