Target
Carbonic anhydrase 2
Ligand
BDBM50067991
Substrate
Meas. Tech.
ChEMBL_1466432 (CHEMBL3406377)
Ki
107±n/a nM
Citation
 Bozdag, MCarta, FVullo, DAkdemir, AIsik, SLanzi, CScozzafava, AMasini, ESupuran, CT Synthesis of a new series of dithiocarbamates with effective human carbonic anhydrase inhibitory activity and antiglaucoma action. Bioorg Med Chem 23:2368-76 (2015)  
Target
Name:
Carbonic anhydrase 2
Synonyms:
CA-II CAC Carbonate dehydratase II Carbonic anhydrase 2 (CA-II) Carbonic anhydrase C Carbonic anhydrase II (CA-II) Carbonic anhydrase II (hCA II) | Carbonic anhydrase isoenzyme II (hCA II)
Type:
Enzyme
Mol. Mass.:
29250.71
Organism:
Homo sapiens (Human)
Description:
P00918
Residue:
260
  
Inhibitor
Name:
BDBM50067991
Synonyms:
CHEMBL3400815
Type:
Small organic molecule
Emp. Form.:
C9H10NNaS2
Mol. Mass.:
219.302
SMILES:
[Na+].[S-]C(=S)NCCc1ccccc1
: