Target
Carbonic anhydrase 12
Ligand
BDBM50067998
Substrate
Meas. Tech.
ChEMBL_1466434 (CHEMBL3406379)
Ki
90±n/a nM
Citation
 Bozdag, MCarta, FVullo, DAkdemir, AIsik, SLanzi, CScozzafava, AMasini, ESupuran, CT Synthesis of a new series of dithiocarbamates with effective human carbonic anhydrase inhibitory activity and antiglaucoma action. Bioorg Med Chem 23:2368-76 (2015)  
Target
Name:
Carbonic anhydrase 12
Synonyms:
CA-XII CAH12_HUMAN Carbonic anhydrase Carbonic anhydrase XII Carbonic anhydrase XII (CAXII) | Tumor antigen HOM-RCC-3.1.3
Type:
Enzyme
Mol. Mass.:
39456.00
Organism:
Homo sapiens (Human)
Description:
Catalytic domain of human cloned isozyme was used in the assay
Residue:
354
  
Inhibitor
Name:
BDBM50067998
Synonyms:
CHEMBL3400802
Type:
Small organic molecule
Emp. Form.:
C8H13N2NaS2
Mol. Mass.:
224.322
SMILES:
[Na+].[S-]C(=S)N[C@H]1CN2CCC1CC2
: