Target
Potassium voltage-gated channel subfamily H member 2
Ligand
BDBM50068001
Substrate
Meas. Tech.
ChEMBL_1463729 (CHEMBL3404543)
IC50
>60000±n/a nM
Citation
 Singh, SBKaelin, DEWu, JMiesel, LTan, CMBlack, TNargund, RMeinke, PTOlsen, DBLagrutta, ALu, JPatel, SRickert, KWSmith, RFSoisson, SSherer, EJoyce, LAWei, CPeng, XWang, XFukuda, HKishii, RTakei, MTakano, HShibasaki, MYajima, MNishimura, AShibata, TFukuda, Y Tricyclic 1,5-naphthyridinone oxabicyclooctane-linked novel bacterial topoisomerase inhibitors as broad-spectrum antibacterial agents-SAR of left-hand-side moiety (Part-2). Bioorg Med Chem Lett 25:1831-5 (2015)  
Target
Name:
Potassium voltage-gated channel subfamily H member 2
Synonyms:
1,3-beta-glucan synthase component GLS2 ERG Eag-related protein 1 Ether-a-go-go-related gene (HERG) Ether-a-go-go-related gene potassium channel 1 Ether-a-go-go-related gene potassium channel 1 (hERG1) Ether-a-go-go-related protein 1 H-ERG KCNH2 Potassium voltage-gated channel subfamily H member 2 (hERG) Voltage-gated potassium channel subunit Kv11.1 hERG Potassium Channel 1 | putative potassium channel subunit
Type:
Multi-pass membrane protein
Mol. Mass.:
126672.65
Organism:
Homo sapiens (Human)
Description:
Q12809
Residue:
1159
  
Inhibitor
Name:
BDBM50068001
Synonyms:
CHEMBL3400817
Type:
Small organic molecule
Emp. Form.:
C26H26FN5O5
Mol. Mass.:
507.5135
SMILES:
O[C@@]1(CC23CCC(CC2)(CO3)NCc2ccc3OCC(=O)Nc3n2)Cn2c3c1c(F)cnc3ccc2=O
: