Target
Amine oxidase [flavin-containing] B
Ligand
BDBM50068019
Substrate
Meas. Tech.
ChEMBL_1463748 (CHEMBL3404562)
IC50
7290±n/a nM
Citation
 Engelbrecht, IPetzer, JPPetzer, A The synthesis and evaluation of sesamol and benzodioxane derivatives as inhibitors of monoamine oxidase. Bioorg Med Chem Lett 25:1896-900 (2015)  
Target
Name:
Amine oxidase [flavin-containing] B
Synonyms:
AOFB_HUMAN MAOB Monoamine oxidase type B (MAO B) Monoamine oxidase type B (MAOB)
Type:
Protein
Mol. Mass.:
58768.76
Organism:
Homo sapiens (Human)
Description:
P27338
Residue:
520
  
Inhibitor
Name:
BDBM50068019
Synonyms:
CHEMBL3400170
Type:
Small organic molecule
Emp. Form.:
C16H16O3
Mol. Mass.:
256.2964
SMILES:
C(COc1ccc2OCOc2c1)Cc1ccccc1
: