Target
Amine oxidase [flavin-containing] A
Ligand
BDBM50068026
Substrate
Meas. Tech.
ChEMBL_1463746 (CHEMBL3404560)
IC50
27800±n/a nM
Citation
 Engelbrecht, IPetzer, JPPetzer, A The synthesis and evaluation of sesamol and benzodioxane derivatives as inhibitors of monoamine oxidase. Bioorg Med Chem Lett 25:1896-900 (2015)  
Target
Name:
Amine oxidase [flavin-containing] A
Synonyms:
AOFA_HUMAN MAO-A Monoamine oxidase Monoamine oxidase type A (MAO A) Monoamine oxidase type A (MAOA)
Type:
Protein
Mol. Mass.:
59689.53
Organism:
Homo sapiens (Human)
Description:
P21397
Residue:
527
  
Inhibitor
Name:
BDBM50068026
Synonyms:
CHEMBL3402198
Type:
Small organic molecule
Emp. Form.:
C16H16O3
Mol. Mass.:
256.2964
SMILES:
C(Cc1ccccc1)Oc1ccc2OCCOc2c1
: