Target
Intestinal-type alkaline phosphatase
Ligand
BDBM50068220
Substrate
Meas. Tech.
ChEMBL_1464325 (CHEMBL3404592)
IC50
1180±n/a nM
Citation
 Al-Rashida, MEjaz, SAAli, SShaukat, AHamayoun, MAhmed, MIqbal, J Diarylsulfonamides and their bioisosteres as dual inhibitors of alkaline phosphatase and carbonic anhydrase: Structure activity relationship and molecular modelling studies. Bioorg Med Chem 23:2435-44 (2015)  
Target
Name:
Intestinal-type alkaline phosphatase
Synonyms:
ALPI Intestinal alkaline phosphatase (IAP) PPBI_BOVIN
Type:
Protein
Mol. Mass.:
57094.82
Organism:
Bos taurus (Cattle)
Description:
P19111
Residue:
533
  
Inhibitor
Name:
BDBM50068220
Synonyms:
CHEMBL3403320
Type:
Small organic molecule
Emp. Form.:
C14H13FN2O3S
Mol. Mass.:
308.328
SMILES:
NS(=O)(=O)c1ccc(CNC(=O)c2ccc(F)cc2)cc1
: