Target
Carbonic anhydrase 2
Ligand
BDBM16661
Substrate
Meas. Tech.
ChEMBL_1464326 (CHEMBL3404593)
IC50
100±n/a nM
Citation
 Al-Rashida, MEjaz, SAAli, SShaukat, AHamayoun, MAhmed, MIqbal, J Diarylsulfonamides and their bioisosteres as dual inhibitors of alkaline phosphatase and carbonic anhydrase: Structure activity relationship and molecular modelling studies. Bioorg Med Chem 23:2435-44 (2015)  
Target
Name:
Carbonic anhydrase 2
Synonyms:
CA2 Carbonic anhydrase Carbonic anhydrase II Carbonic anhydrase II (CA-II)
Type:
Enzyme Catalytic Domain
Mol. Mass.:
29115.93
Organism:
Bos taurus
Description:
Residue:
260
  
Inhibitor
Name:
BDBM16661
Synonyms:
1-N-(4-fluorobenzene)benzene-1,4-disulfonamide | aromatic sulfonamide compound 26
Type:
Small organic molecule
Emp. Form.:
C12H11FN2O4S2
Mol. Mass.:
330.355
SMILES:
NS(=O)(=O)c1ccc(NS(=O)(=O)c2ccc(F)cc2)cc1
: