Target
High affinity cAMP-specific 3',5'-cyclic phosphodiesterase 7A
Ligand
BDBM50068287
Substrate
Meas. Tech.
ChEMBL_1464338 (CHEMBL3404605)
IC50
3.3±n/a nM
Citation
 Endo, YKawai, KAsano, TAmano, SAsanuma, YSawada, KOnodera, YUeo, NTakahashi, NSonoda, YKamei, NIrie, T 2-(Isopropylamino)thieno[3,2-d]pyrimidin-4(3H)-one derivatives as selective phosphodiesterase 7 inhibitors with potent in vivo efficacy. Bioorg Med Chem Lett 25:1910-4 (2015)  
Target
Name:
High affinity cAMP-specific 3',5'-cyclic phosphodiesterase 7A
Synonyms:
3',5'-cyclic phosphodiesterase PDE7A_HUMAN Phosphodiesterase 7 (PDE7) Phosphodiesterase 7A (PDE7A1)
Type:
Enzyme
Mol. Mass.:
55514.96
Organism:
Homo sapiens (Human)
Description:
Q13946
Residue:
482
  
Inhibitor
Name:
BDBM50068287
Synonyms:
CHEMBL3403346
Type:
Small organic molecule
Emp. Form.:
C22H27N5O2S
Mol. Mass.:
425.547
SMILES:
CCn1c(NC(C)C)nc2c(csc2c1=O)C1CCN(C1)C(=O)c1cccc(C)n1
: