Target
Tyrosine-protein kinase BTK
Ligand
BDBM50068542
Substrate
Meas. Tech.
ChEMBL_1466554 (CHEMBL3407011)
IC50
208±n/a nM
Citation
 Asami, TKawahata, WSawa, M TR-FRET binding assay targeting unactivated form of Bruton's tyrosine kinase. Bioorg Med Chem Lett 25:2033-6 (2015)  
Target
Name:
Tyrosine-protein kinase BTK
Synonyms:
AGMX1 Agammaglobulinaemia tyrosine kinase B cell progenitor kinase BPK BTK_HUMAN Tyrosine Kinase BTK Tyrosine-protein kinase BTK (BTK)
Type:
Enzyme
Mol. Mass.:
76289.95
Organism:
Homo sapiens (Human)
Description:
Q06187
Residue:
659
  
Inhibitor
Name:
BDBM50068542
Synonyms:
CHEMBL3400826
Type:
Small organic molecule
Emp. Form.:
C54H49N7O8S
Mol. Mass.:
956.074
SMILES:
Cc1c(NC(=O)c2ccc(cc2)C(C)(C)C)cccc1-c1cn(C)c(=O)c(Nc2ccc(cc2)C(=O)NCCCNC(=S)Nc2ccc(c(c2)C(O)=O)-c2c3ccc(O)cc3oc3cc(=O)ccc23)n1
: