Target
Tyrosine-protein kinase SYK
Ligand
BDBM50068798
Substrate
Meas. Tech.
ChEMBL_1466562 (CHEMBL3407019)
EC50
530±n/a nM
Citation
 Argade, ABhamidipati, SLi, HCarroll, DClough, JKeim, HSylvain, CRossi, ABCoquilla, CIssakani, SDMasuda, ESPayan, DGSingh, R Application of cultured human mast cells (CHMC) for the design and structure-activity relationship of IgE-mediated mast cell activation inhibitors. Bioorg Med Chem Lett 25:2117-21 (2015)  
Target
Name:
Tyrosine-protein kinase SYK
Synonyms:
KSYK_HUMAN Spleen Tyrosine Kinase Tyrosine-protein kinase SYK (Syk)
Type:
Enzyme
Mol. Mass.:
72079.99
Organism:
Homo sapiens (Human)
Description:
P43405
Residue:
635
  
Inhibitor
Name:
BDBM50068798
Synonyms:
CHEMBL3402394
Type:
Small organic molecule
Emp. Form.:
C18H16FN5O3
Mol. Mass.:
369.3497
SMILES:
NC(=O)COc1ccc(Nc2ncc(F)c(Nc3cccc(O)c3)n2)cc1
: