Target
Tyrosine-protein kinase SYK
Ligand
BDBM50249090
Substrate
Meas. Tech.
ChEMBL_1466562 (CHEMBL3407019)
EC50
350±n/a nM
Citation
 Argade, ABhamidipati, SLi, HCarroll, DClough, JKeim, HSylvain, CRossi, ABCoquilla, CIssakani, SDMasuda, ESPayan, DGSingh, R Application of cultured human mast cells (CHMC) for the design and structure-activity relationship of IgE-mediated mast cell activation inhibitors. Bioorg Med Chem Lett 25:2117-21 (2015)  
Target
Name:
Tyrosine-protein kinase SYK
Synonyms:
KSYK_HUMAN Spleen Tyrosine Kinase Tyrosine-protein kinase SYK (Syk)
Type:
Enzyme
Mol. Mass.:
72079.99
Organism:
Homo sapiens (Human)
Description:
P43405
Residue:
635
  
Inhibitor
Name:
BDBM50249090
Synonyms:
3,3'-(5-fluoropyrimidine-2,4-diyl)bis(azanediyl)diphenol | CHEMBL515271
Type:
Small organic molecule
Emp. Form.:
C16H13FN4O2
Mol. Mass.:
312.2984
SMILES:
Oc1cccc(Nc2ncc(F)c(Nc3cccc(O)c3)n2)c1
: