Target
Hepatocyte growth factor activator
Ligand
BDBM50069126
Substrate
Meas. Tech.
ChEMBL_1466696 (CHEMBL3404294)
IC50
>50000±n/a nM
Citation
 Franco, FMJones, DEHarris, PKHan, ZWildman, SAJarvis, CMJanetka, JW Structure-based discovery of small molecule hepsin and HGFA protease inhibitors: Evaluation of potency and selectivity derived from distinct binding pockets. Bioorg Med Chem 23:2328-43 (2015)  
Target
Name:
Hepatocyte growth factor activator
Synonyms:
HGF activator HGFAC Hepatocyte growth factor activator Hepatocyte growth factor activator short chain
Type:
PROTEIN
Mol. Mass.:
70690.18
Organism:
Homo sapiens (Human)
Description:
ChEMBL_109514
Residue:
655
  
Inhibitor
Name:
BDBM50069126
Synonyms:
CHEMBL3403526
Type:
Small organic molecule
Emp. Form.:
C19H18N4O4S
Mol. Mass.:
398.436
SMILES:
COC(=O)c1ccc2cc(NS(=O)(=O)c3ccc(NC(N)=N)cc3)ccc2c1
: