Target
Hepatocyte growth factor activator
Ligand
BDBM23887
Substrate
Meas. Tech.
ChEMBL_1466697 (CHEMBL3404295)
Ki
17000±n/a nM
Citation
 Franco, FMJones, DEHarris, PKHan, ZWildman, SAJarvis, CMJanetka, JW Structure-based discovery of small molecule hepsin and HGFA protease inhibitors: Evaluation of potency and selectivity derived from distinct binding pockets. Bioorg Med Chem 23:2328-43 (2015)  
Target
Name:
Hepatocyte growth factor activator
Synonyms:
HGF activator HGFAC Hepatocyte growth factor activator Hepatocyte growth factor activator short chain
Type:
PROTEIN
Mol. Mass.:
70690.18
Organism:
Homo sapiens (Human)
Description:
ChEMBL_109514
Residue:
655
  
Inhibitor
Name:
BDBM23887
Synonyms:
3-amidinophenylalanine deriv., 31 | 4-({4-[(2S)-3-(3-carbamimidoylphenyl)-2-{[2,4,6-tris(propan-2-yl)benzene]sulfonamido}propanoyl]piperazin-1-yl}carbonyl)piperidine-1-carboximidamide
Type:
Small organic molecule
Emp. Form.:
C36H54N8O4S
Mol. Mass.:
694.93
SMILES:
CC(C)c1cc(C(C)C)c(c(c1)C(C)C)S(=O)(=O)N[C@@H](Cc1cccc(c1)C(N)=N)C(=O)N1CCN(CC1)C(=O)C1CCN(CC1)C(N)=N
: