Target
Carbonic anhydrase
Ligand
BDBM10870
Substrate
Meas. Tech.
ChEMBL_1466707 (CHEMBL3404500)
Ki
6.8±n/a nM
Citation
 Syrjänen, LKuuslahti, MTolvanen, MVullo, DParkkila, SSupuran, CT Theß-carbonic anhydrase from the malaria mosquito Anopheles gambiae is highly inhibited by sulfonamides. Bioorg Med Chem 23:2303-9 (2015)  
Target
Name:
Carbonic anhydrase
Synonyms:
Carbonate dehydratase | Carbonic anhydrase
Type:
PROTEIN
Mol. Mass.:
29919.95
Organism:
Anopheles gambiae
Description:
ChEMBL_109570
Residue:
255
  
Inhibitor
Name:
BDBM10870
Synonyms:
2-N-(4-aminobenzene)-1,3,4-thiadiazole-2,5-disulfonamide CHEMBL268439 aminobenzolamide deriv. 43 | aromatic/heteroaromatic sulfonamide 15
Type:
Small organic molecule
Emp. Form.:
C8H9N5O4S3
Mol. Mass.:
335.383
SMILES:
Nc1ccc(cc1)S(=O)(=O)Nc1nnc(s1)S(N)(=O)=O
: