Target
Scavenger receptor class B member 1
Ligand
BDBM50069716
Substrate
Meas. Tech.
ChEMBL_1466965 (CHEMBL3406604)
IC50
10000±n/a nM
Citation
 Dockendorff, CFaloon, PWPu, JYu, MJohnston, SBennion, MPenman, MNieland, TJDandapani, SPerez, JRMunoz, BPalmer, MASchreiber, SLKrieger, M Benzo-fused lactams from a diversity-oriented synthesis (DOS) library as inhibitors of scavenger receptor BI (SR-BI)-mediated lipid uptake. Bioorg Med Chem Lett 25:2100-5 (2015)  
Target
Name:
Scavenger receptor class B member 1
Synonyms:
SCRB1_MOUSE Scarb1 Srb1
Type:
PROTEIN
Mol. Mass.:
56761.39
Organism:
Mus musculus
Description:
ChEMBL_103999
Residue:
509
  
Inhibitor
Name:
BDBM50069716
Synonyms:
CHEMBL3400880
Type:
Small organic molecule
Emp. Form.:
C25H30ClN7O6S
Mol. Mass.:
592.067
SMILES:
C[C@H](CO)N1C[C@@H](C)[C@H](CN(C)S(=O)(=O)c2ccc(Cl)cc2)Oc2ccc(NC(=O)Cn3cnnn3)cc2C1=O
: