Target
Aromatase
Ligand
BDBM50398447
Substrate
Meas. Tech.
ChEMBL_1469289 (CHEMBL3414091)
IC50
50±n/a nM
Citation
 Varela, CLAmaral, CTavares da Silva, ELopes, ACorreia-da-Silva, GCarvalho, RACosta, SCRoleira, FMTeixeira, N Exemestane metabolites: Synthesis, stereochemical elucidation, biochemical activity and anti-proliferative effects in a hormone-dependent breast cancer cell line. Eur J Med Chem 87:336-45 (2014)  
Target
Name:
Aromatase
Synonyms:
ARO1 CP19A_HUMAN CYP19 CYPXIX Cytochrome P450 19A1 Cytochrome P450-C19 (CYP19) FL cytokine receptor precursor | P-450AROM
Type:
Enzyme
Mol. Mass.:
57888.92
Organism:
Homo sapiens (Human)
Description:
P11511
Residue:
503
  
Inhibitor
Name:
BDBM50398447
Synonyms:
Aromasin | EXEMESTANE
Type:
Small organic molecule
Emp. Form.:
C20H24O2
Mol. Mass.:
296.4034
SMILES:
C[C@]12CC[C@H]3[C@@H](CC(=C)C4=CC(=O)C=C[C@]34C)[C@@H]1CCC2=O
: