Target
Ubiquitin carboxyl-terminal hydrolase 7
Ligand
BDBM50393440
Substrate
Meas. Tech.
ChEMBL_1469485 (CHEMBL3412282)
EC50
4200±n/a nM
Citation
 Ndubaku, CTsui, V Inhibiting the deubiquitinating enzymes (DUBs). J Med Chem 58:1581-95 (2015)  
Target
Name:
Ubiquitin carboxyl-terminal hydrolase 7
Synonyms:
Deubiquitinating enzyme 7 Herpesvirus-associated ubiquitin-specific protease USP7 Ubiquitin-specific-processing protease 7
Type:
PROTEIN
Mol. Mass.:
128274.45
Organism:
Homo sapiens (Human)
Description:
ChEMBL_1469483
Residue:
1102
  
Inhibitor
Name:
BDBM50393440
Synonyms:
CHEMBL2159498
Type:
Small organic molecule
Emp. Form.:
C12H7F2NO3S2
Mol. Mass.:
315.316
SMILES:
CC(=O)c1cc(c(Sc2ccc(F)cc2F)s1)[N+]([O-])=O
: