Target
Phosphatidylinositol 4,5-bisphosphate 3-kinase catalytic subunit beta isoform
Ligand
BDBM50070323
Substrate
Meas. Tech.
ChEMBL_1467019 (CHEMBL3411216)
IC50
5.0±n/a nM
Citation
 Barlaam, BCosulich, SDegorce, SFitzek, MGreen, SHancox, ULambert-van der Brempt, CLohmann, JJMaudet, MMorgentin, RPasquet, MJPéru, APlé, PSaleh, TVautier, MWalker, MWard, LWarin, N Discovery of (R)-8-(1-(3,5-difluorophenylamino)ethyl)-N,N-dimethyl-2-morpholino-4-oxo-4H-chromene-6-carboxamide (AZD8186): a potent and selective inhibitor of PI3Kß and PI3Kd for the treatment of PTEN-deficient cancers. J Med Chem 58:943-62 (2015)  
Target
Name:
Phosphatidylinositol 4,5-bisphosphate 3-kinase catalytic subunit beta isoform
Synonyms:
PI3-kinase p110 subunit beta PI3Kbeta PIK3CB Phosphatidylinositol 4,5-bisphosphate 3-kinase catalytic subunit beta (PI3Kbeta) Phosphatidylinositol 4,5-bisphosphate 3-kinase catalytic subunit beta isoform (PI3K) Phosphatidylinositol 4,5-bisphosphate 3-kinase catalytic subunit beta isoform (PI3Kbeta) Phosphatidylinositol-4,5-bisphosphate 3-kinase catalytic subunit beta isoform Phosphoinositide 3-Kinase (PI3K), beta Chain A PtdIns-3-kinase p110
Type:
Enzyme Subunit
Mol. Mass.:
122769.00
Organism:
Homo sapiens (Human)
Description:
P42338
Residue:
1070
  
Inhibitor
Name:
BDBM50070323
Synonyms:
CHEMBL3408250 | US9718800, 3.04b
Type:
Small organic molecule
Emp. Form.:
C24H25ClFN3O4
Mol. Mass.:
473.924
SMILES:
C[C@@H](Nc1cccc(Cl)c1F)c1cc(cc2c1oc(cc2=O)N1CCOCC1)C(=O)N(C)C
: