Target
Mu-type opioid receptor
Ligand
BDBM50070380
Substrate
Meas. Tech.
ChEMBL_1467660 (CHEMBL3411022)
Ki
0.090000±n/a nM
Citation
 Guillemyn, KKleczkowska, PLesniak, ADyniewicz, JVan der Poorten, OVan den Eynde, IKeresztes, AVarga, ELai, JPorreca, FChung, NNLemieux, CMika, JRojewska, EMakuch, WVan Duppen, JPrzewlocka, BVanden Broeck, JLipkowski, AWSchiller, PWTourwé, DBallet, S Synthesis and biological evaluation of compact, conformationally constrained bifunctional opioid agonist - neurokinin-1 antagonist peptidomimetics. Eur J Med Chem 92:64-77 (2015)  
Target
Name:
Mu-type opioid receptor
Synonyms:
MOR-1 Mu-type opioid receptor (MOR) OPRM_RAT Opioid receptor B Ror-b
Type:
G Protein-Coupled Receptor (GPCR)
Mol. Mass.:
44503.11
Organism:
Rattus norvegicus (rat)
Description:
Competition binding assays were carried out using membrane preparations from transfected HN9.10 cells that constitutively expressed the mu opioid receptor.
Residue:
398
  
Inhibitor
Name:
BDBM50070380
Synonyms:
CHEMBL3408522
Type:
Small organic molecule
Emp. Form.:
C37H48N8O5
Mol. Mass.:
684.8276
SMILES:
[H][C@@]1(Cc2ccccc2CN(CC(=O)N(C)Cc2ccccc2)C1=O)NC(=O)[C@@H](CCCNC(N)=N)NC(=O)[C@@H](N)Cc1c(C)cc(O)cc1C
: