Target
Prostaglandin G/H synthase 1
Ligand
BDBM50070492
Substrate
Meas. Tech.
ChEMBL_1467707 (CHEMBL3411144)
IC50
>100000±n/a nM
Citation
 Alanazi, AMEl-Azab, ASAl-Suwaidan, IAElTahir, KEAsiri, YAAbdel-Aziz, NIAbdel-Aziz, AA Structure-based design of phthalimide derivatives as potential cyclooxygenase-2 (COX-2) inhibitors: anti-inflammatory and analgesic activities. Eur J Med Chem 92:115-23 (2015)  
Target
Name:
Prostaglandin G/H synthase 1
Synonyms:
COX1 Cyclooxygenase-1 (COX-1) PTGS1 | Prostaglandin G/H synthase (cyclooxygenase)
Type:
Protein
Mol. Mass.:
68868.60
Organism:
Ovis aries (Sheep)
Description:
Residue:
600
  
Inhibitor
Name:
BDBM50070492
Synonyms:
CHEMBL3408775
Type:
Small organic molecule
Emp. Form.:
C19H19NO5
Mol. Mass.:
341.3579
SMILES:
COc1cc(CN2C(=O)c3ccc(C)cc3C2=O)cc(OC)c1OC
: