Target
Carbonic anhydrase 2/3/4/6
Ligand
BDBM50070606
Substrate
Meas. Tech.
ChEMBL_1468134 (CHEMBL3414020)
Ki
2.0±n/a nM
Citation
 Haider, SAlam, MSHamid, H 1,3,4-Thiadiazoles: a potent multi targeted pharmacological scaffold. Eur J Med Chem 92:156-77 (2015)  
Target
Name:
Carbonic anhydrase 2/3/4/6
Synonyms:
Carbonic anhydrase
Type:
Mol. Mass.:
Description:
ASSAY_ID of ChEMBL is 1468134
Components:
This complex has 4 components.
Component 1
Name:
Carbonic anhydrase 6
Synonyms:
CA-VI CAH6_BOVIN Carbonic anhydrase 6 Salivary carbonic anhydrase | Secreted carbonic anhydrase
Type:
PROTEIN
Mol. Mass.:
37008.14
Organism:
Bos taurus
Description:
ChEMBL_104851
Residue:
319
  
Component 2
Name:
Carbonic anhydrase 2
Synonyms:
CA2 Carbonic anhydrase Carbonic anhydrase II Carbonic anhydrase II (CA-II)
Type:
Enzyme Catalytic Domain
Mol. Mass.:
29115.93
Organism:
Bos taurus
Description:
Residue:
260
  
Component 3
Name:
Carbonic anhydrase 3
Synonyms:
CA-III CAH3_BOVIN Carbonic anhydrase 3 Carbonic anhydrase III
Type:
Enzyme
Mol. Mass.:
29376.92
Organism:
Bos taurus (Cattle)
Description:
Q3SZX4
Residue:
260
  
Component 4
Name:
Carbonic anhydrase 4
Synonyms:
CA-IV CAH4_BOVIN Carbonic Anhydrase IV Carbonic anhydrase 4
Type:
Enzyme
Mol. Mass.:
35152.74
Organism:
Bos taurus (bovine)
Description:
Bovine isozyme, isolated from lung microsomes
Residue:
312
  
Inhibitor
Name:
BDBM50070606
Synonyms:
CHEMBL3408993
Type:
Small organic molecule
Emp. Form.:
C13H12ClN5O8S3
Mol. Mass.:
497.911
SMILES:
[O-][Cl](=O)(=O)=O.NS(=O)(=O)c1nnc(NS(=O)(=O)c2ccc(cc2)-[n+]2ccccc2)s1
: