Target
Alpha-2C adrenergic receptor
Ligand
BDBM50070798
Substrate
Meas. Tech.
ChEMBL_1468616 (CHEMBL3413562)
Ki
190±n/a nM
Citation
 Kolaczkowski, MMarcinkowska, MBucki, ASniecikowska, JPawlowski, MKazek, GSiwek, AJastrzebska-Wiesek, MPartyka, AWasik, AWesolowska, AMierzejewski, PBienkowski, P Novel 5-HT6 receptor antagonists/D2 receptor partial agonists targeting behavioral and psychological symptoms of dementia. Eur J Med Chem 92:221-35 (2015)  
Target
Name:
Alpha-2C adrenergic receptor
Synonyms:
ADA2C_HUMAN ADRA2L2 Adrenergic alpha2C Adrenergic receptor alpha Alpha-2 adrenergic receptor subtype C4 Alpha-2C adrenoreceptor | adrenergic, alpha-2C-, receptor [Homo sapiens]
Type:
Enzyme
Mol. Mass.:
49552.32
Organism:
Homo sapiens (Human)
Description:
P18825
Residue:
462
  
Inhibitor
Name:
BDBM50070798
Synonyms:
CHEMBL3409256
Type:
Small organic molecule
Emp. Form.:
C28H30N4O4S
Mol. Mass.:
518.627
SMILES:
NC(=O)c1ccccc1OCCCN1CCN(CC1)c1cccc2n(ccc12)S(=O)(=O)c1ccccc1
: